Dependency Management Issues
integrationActiveStableThe error seems to stem from changes in commits, suggesting a lack of clarity in dependency management and version control.
Score Breakdown
Heuristic ranking from public discussion signals — not a validated prediction of commercial opportunity, demand, or willingness to pay.
Composite 70/100 (High, unvalidated). Top driver: Willingness to pay (30% weight, 22.5 pts).
Heuristic only — often urgency map or random scaffolding on ingest, not measured mention frequency. Maps to XPS relevance (with market size).
LLM/mock judgment of intensity from title/summary text — not ops or ticket data. Maps to XPS quality (with willingness to pay).
LLM/mock purchase-intent guess from text — not invoices, surveys, or paid seats. Maps to XPS quality.
Heuristic/scaffold (often random or fixed on insert) — not a verified mention trajectory. Maps to XPS novelty.
Heuristic/scaffold (often random or fixed) — not TAM research. Maps to XPS relevance (with frequency).
Catalog notes (not predictive analysis)
Dependency Management Issues (integration). Catalog heuristic opportunity score: 70/100 — a chosen formula over discussion-signal facets, not evidence of demand, conversion, or willingness to pay. Treat as browsing rank, not a commercial prediction.
The error seems to stem from changes in commits, suggesting a lack of clarity in dependency management and version control.
Source Examples
“[Asan + msvc] Cpython build failed with error LNK2001: unresolved external symbol on windows # Bug report ### Bug description: Cpython build failed with error LNK2001: unresolved external symbol on windows, this error looks start from commit 10f950c9bb0ff4583f361a42aaed562b330e1dba, the previous commit 9846407eaf385917d134ef5e3700c57c59f67684 built successfully. Repro steps: ``` 1. git clone https://github.com/python/cpython 2. Open VS2022 x64 CMD & set _CL_= /fsanitize=address /GS- /wd5072 & set _LINK_= /InferASanLibs /incremental:no /debug 3. cd /d C:\gitP\python\cpython\PCBuild 4. get_externals.bat --clean-only 5. build -e -p x64 -r --no-tkinter -v "/p:PlatformToolset=v143" "/p:WindowsTargetPlatformVersion=10.0.26100.0" ``` Failures ``` (Link target) -> clang_rt.asan_dynamic_runtime_thunk-x86_64.lib(sanitizer_win_thunk_interception.cpp.obj) : error LNK2001: unresolved external symbol abort [C:\gitP\python\cpython\PCbuild\python3tdll.vcxproj] clang_rt.asan_dynamic_runtime_thunk-x86_64.lib(asan_win_dynamic_runtime_thunk.cpp.obj) : error LNK2001: unresolved external symbol _initterm [C:\gitP\python\cpython\PCbuild\python3tdll.vcxproj] MSVCRT.lib(utility.obj) : error LNK2001: unresolved external symbol __vcrt_initialize [C:\gitP\python\cpython\PCbuild\python3tdll.vcxproj] MSVCRT.lib(utility.obj) : error LNK2001: unresolved external symbol __vcrt_uninitialize [C:\gitP\python\cpython\PCbuild\python3tdll.vcxproj] MSVCRT.lib(utility.obj) : error LNK2001: unresolved external symbol __vcrt_uninitialize_critical [C:\gitP\python\cpython\PCbuild\python3tdll.vcxproj] MSVCRT.lib(utility.obj) : error LNK2001: unresolved external symbol __vcrt_thread_attach [C:\gitP\python\cpython\PCbuild\python3tdll.vcxproj] MSVCRT.lib(utility.obj) : error LNK2001: unresolved external symbol __vcrt_thread_detach [C:\gitP\python\cpython\PCbuild\python3tdll.vcxproj] MSVCRT.lib(utility.obj) : error LNK2001: unresolved external symbol _seh_filter_dll [C:\gitP\python\cpython\PCbuild\python3tdll.vcxproj] MSVCRT.lib(utility.obj) : error LNK2001: unresolved external symbol _is_c_termination_complete [C:\gitP\python\cpython\PCbuild\python3tdll.vcxproj] MSVCRT.lib(utility.obj) : error LNK2001: unresolved external symbol _configure_narrow_argv [C:\gitP\python\cpython\PCbuild\python3tdll.vcxproj] MSVCRT.lib(utility.obj) : error LNK2001: unresolved external symbol _initialize_narrow_environment [C:\gitP\python\cpython\PCbuild\python3tdll.vcxproj] MSVCRT.lib(utility.obj) : error LNK2001: unresolved external symbol _initialize_onexit_table [C:\gitP\python\cpython\PCbuild\python3tdll.vcxproj] MSVCRT.lib(utility.obj) : error LNK2001: unresolved external symbol _register_onexit_function [C:\gitP\python\cpython\PCbuild\python3tdll.vcxproj] MSVCRT.lib(utility.obj) : error LNK2001: unresolved external symbol _execute_onexit_table [C:\gitP\python\cpython\PCbuild\python3tdll.vcxproj] MSVCRT.lib(utility.obj) : error LNK2001: unresolved external symbol _crt_atexit [C:\gitP\python\cpython\PCbuild\python3tdll.vcxproj] MSVCRT.lib(utility.obj) : error LNK2001: unresolved external symbol _crt_at_quick_exit [C:\gitP\python\cpython\PCbuild\python3tdll.vcxproj] MSVCRT.lib(utility.obj) : error LNK2001: unresolved external symbol __acrt_initialize [C:\gitP\python\cpython\PCbuild\python3tdll.vcxproj] MSVCRT.lib(utility.obj) : error LNK2001: unresolved external symbol __acrt_uninitialize [C:\gitP\python\cpython\PCbuild\python3tdll.vcxproj] MSVCRT.lib(utility.obj) : error LNK2001: unresolved external symbol __acrt_uninitialize_critical [C:\gitP\python\cpython\PCbuild\python3tdll.vcxproj] MSVCRT.lib(utility.obj) : error LNK2001: unresolved external symbol __acrt_thread_attach [C:\gitP\python\cpython\PCbuild\python3tdll.vcxproj] MSVCRT.lib(utility.obj) : error LNK2001: unresolved external symbol __acrt_th”
Competitive Landscape
- Existing solutions are either too expensive or too limited
- Most competitors target enterprise, leaving mid-market underserved
- Community scripts and manual processes are the primary alternative
Recommended Next Steps
- ✓Validate pain intensity with 5-10 target customer interviews
- ✓Build minimal viable solution addressing the core workflow
- ✓Test pricing with early adopters from community forums
Related Pain Points
Target Customers
- IT teams at mid-size organizations (100-2000 employees)
- MSPs and consultants managing multiple client environments
- Teams without dedicated specialist staff for this domain
Monetization Ideas
- 1SaaS subscription model ($99-$499/month depending on scale)
- 2Usage-based pricing aligned with value delivered
- 3Freemium tier to drive adoption and prove value